{"text_format":"1","workbook":"xlsx","n_sheets":5,"sheets":["Data","Proceedings","Bill Preparation","Bill","aptc 49"],"not_rendered":{"charts":0,"images":0,"macros":1,"external_links":1,"defined_names":1,"comments":0,"pivot_tables":0},"unopened":[],"bounds":{"document_bytes":16777216,"sheet_cells":100000,"rows_first":2000,"rows_last":500,"rows_between":2000,"halvings":0,"cell_chars":16384,"cell_head_chars":4096},"cells_cut":0,"cells_raw":0,"read":"whole","date_system":"1900"}

{"sheet":"Data","index":0,"n_rows":182,"n_cols":22,"rows_kept":182,"cut":false,"hidden":false,"merged":[[13,7,13,8],[14,1,14,3],[15,1,15,3],[0,0,0,3],[1,1,1,2],[12,0,12,3],[2,1,2,2],[17,1,17,3],[13,1,13,3]]}
["Data of the Promoted Employee",null,null,null,null,null,null,null,"> < Inc",{"$f":"IF(D8<D5,1,2)","v":2},null,null,null,null,null,null,null,null,null,{"$f":"R2","v":20000}]
["Name","Smt Shaik ASHITUN (CFMS ID15087189)",null,"Female",null,{"$f":"IF(D2=\"Female\",\"her\",\"his\")","v":"her"},{"$f":"IF(Data!O7<Data!P7,1,2)","v":1},null,null,null,null,null,null,null,null,null,null,20000,600,20600,600,21200]
["Design.","PHYSICAL EDUCATION TEACHER",null,"CPS",null,null,null,null,null,null,null,null,null,null,null,null,null,20600,600,21200,600,21800]
["Promoted as","Teacher","Specify the Design."," SCHOOL ASST(Phy Ed)",null,{"$f":"DAY(B5)&\"-\"&MONTH(B5)&\"-\"&YEAR(B5)","v":"11-7-2023"},null,null,null,null,null,null,null,null,null,null,null,21200,600,21800,660,22460]
["Date of Joining","2023-07-11","Date of Increment","2023-06-01",{"$f":"DAY(B5)&\"-\"&MONTH(B5)&\"-\"&YEAR(B5)","v":"11-7-2023"},{"$f":"DAY(D5)&\"-\"&MONTH(D5)&\"-\"&YEAR(D5)","v":"1-6-2023"},{"$f":"DATE(YEAR(B5)+1,MONTH(B5),1)","v":"2024-07-01"},null,null,null,null,null,null,null,null,null,null,21800,660,22460,660,23120]
["Option Date","Promotion Date","Initial fixation done","No",{"$f":"IF(B6=\"Increment Date\",F5,E5)","v":"11-7-2023"},null,null,null,null,null,null,null,null,null,null,"Min Pay",null,22460,660,23120,660,23780]
["Present Scale of Pay","32670-101970","Promotion Scale","44570-127480",null,"FR 22(a)(i)","Pay with normal Inc",{"$f":"B8","v":34580},{"$f":"LOOKUP(H7,$R$2:$R$83,$S$2:$S$83)","v":990},null,null,null,null,{"$f":"SUM(I7:M7)","v":990},{"$f":"LOOKUP(H7,$R$2:$R$83,$T$2:$T$83)","v":35570},{"$f":"I135","v":44570},null,23120,660,23780,720,24500]
[{"$f":"\"Pay as on \"&E5","v":"Pay as on 11-7-2023"},34580,"Bill claimed upto","2023-09-30",{"$f":"D8+1","v":"2023-10-01"},"FR 22(B)","Notional Inc",{"$f":"O7","v":35570},{"$f":"LOOKUP(H8,$R$2:$R$83,$S$2:$S$83)","v":990},null,null,null,null,990,{"$f":"LOOKUP(H8,$R$2:$R$83,$T$2:$T$83)","v":36560},null,null,23780,720,24500,720,25220]
{"$rows_left_out":175}
{"sheet":"Proceedings","index":1,"n_rows":41,"n_cols":5,"rows_kept":41,"cut":false,"hidden":false,"merged":[[38,0,38,2],[38,3,38,4],[26,0,27,2],[28,0,29,2],[30,0,31,2],[33,0,33,4],[34,0,34,4],[37,3,37,4],[24,0,25,2],[0,0,0,4],[1,0,1,4],[5,1,5,4],[13,0,13,4],[14,0,14,4],[15,0,15,4],[17,0,17,4],[18,0,19,2],[20,0,21,2],[23,0,23,4],[9,1,9,4]]}
[{"$f":"\"PROCEEDINGS OF THE \"&Data!B15&\", \"&Data!B16","v":"PROCEEDINGS OF THE HEAD MASTER,  ZPHIGH SCHOOL  EDLAPADU "}]
[{"$f":"\"Present : \"&Data!B14","v":"Present :  G VIJAYA BHARATHI B.Sc, MA, B.Ed"}]
[]
["RC NO :",{"$f":"Data!B17","v":"5/ PROMOTION FR 22B /2023"},null,"Date :",{"$f":"Data!D17","v":"2023-09-19"}]
[]
["Sub:",{"$f":"\"Establishment - \"&Data!B16&\" - \"&PROPER(Data!B2)&\" - Promoted as \"&Data!D4&\" from \"&Data!B3&\"  - Opted to fix \"&Data!F2&\" pay under \"&IF(Data!B9=\"Yes\",\"FR 22(a)(i)\",\"FR 22(B)\")&\" with effect from \"&Data!E6&\" i.e.\"&Data!B6& \" - Pay fixation orders issued - Regarding.\"","v":"Establishment -  ZPHIGH SCHOOL  EDLAPADU  - Smt Shaik Ashitun (Cfms Id15087189) - Promoted as  SCHOOL ASST(Phy Ed) from PHYSICAL EDUCATION TEACHER  - Opted to fix her pay under FR 22(B) with effect from 11-7-2023 i.e.Promotion Date - Pay fixation orders issued - Regarding."}]
[null,"      "]
["Ref: ","1. G.O.Ms.No.1 Finance(PC-TA) Dept. Dt. 17-01-2022"]
{"$rows_left_out":34}
{"sheet":"Bill Preparation","index":2,"n_rows":41,"n_cols":45,"rows_kept":41,"cut":false,"hidden":false,"merged":[[0,0,0,18],[0,44,1,56],[1,19,1,24],[29,19,29,24]]}
["HRA,CCA should be checked and noted correct HRA,CCA in this form compulsorly.\nThis is the Pay bill Prepared by this software. Once again you check all the columns and Proceed to  \"BILL\" sheet",null,null,null,null,null,null,null,null,null,null,null,null,null,null,null,null,null,null,{"$f":"IF(ROUND('Bill Preparation'!F3*10%,0)<900,ROUND('Bill Preparation'!F3*10%,0),900)","v":900},null,null,null,null,null,null,null,null,"2011-05-31",null,null,null,null,null,null,null,null,null,null,null,null,null,null,null,"CCA Rates"]
[null,"FROM",null,"TO","No of Days","Ele Pay","old Pay","DA","HRA","New IR"," New CCA","Old CCA","Total of PPs","F Pay","S Pay","Ele CA/ RA","Old CA/ RA","DA arrear credit to ZPPF","2014-01-01","DA Table",null,null,null,null,null,null,null,null,"From","To","Hyderabad","Vij","Others","Not Applicable","CCA"]
["from",{"$f":"Data!M14","v":"2023-07-11"},"to",{"$f":"DATE(YEAR(B3),MONTH(B3)+1,1)-1","v":"2023-07-31"},{"$f":"(D3-B3)+1","v":21},{"$f":"IF(B3>Data!$D$8,0,IF(B3>=Data!$H$19,Data!$I$19,IF(B3>=Data!$H$18,Data!$I$18,Data!$I$15)))","v":44570},{"$f":"IF(B3>Data!$D$8,0,IF(Data!$D$6=\"Yes\",Data!$O$7,Data!$B$8))","v":34580},22.75,{"$f":"Data!B12","v":10},0,{"$f":"IF(B3>Data!$D$8,0,LOOKUP(F3,$AC$3:$AC$6,$AI$3:$AI$6))","v":0},{"$f":"IF(B3>Data!$D$8,0,LOOKUP(G3,$AC$3:$AC$6,$AI$3:$AI$6))","v":0},{"$f":"IF(B3>Data!$D$8,0,Data!B10)","v":0},{"$f":"IF(B3>Data!$D$8,0,Data!D10)","v":0},{"$f":"IF(B3>Data!$D$8,0,Data!B11)","v":0},{"$f":"IF(B3>Data!$D$8,0,IF(Data!$D$11=\"CA\",IF(ROUND('Bill Preparation'!F3*10%,0)<900,ROUND('Bill Preparation'!F3*10%,0),900),LOOKUP(Data!$B$4,'Bill Preparation'!$AD$9:$AD$11,'Bill Preparation'!$AG$9:$AG$11)))","v":0},{"$f":"IF(B3>Data!$D$8,0,IF(Data!$D$11=\"CA\",IF(ROUND('Bill Preparation'!G3*10%,0)<900,ROUND('Bill Preparation'!G3*10%,0),900),LOOKUP(Data!$B$4,'Bill Preparation'!$AD$9:$AD$11,'Bill Preparation'!$AG$9:$AG$11)))","v":0},{"$f":"IF(Data!$D$3=\"CPS\",0,LOOKUP('Bill Preparation'!B3,'Bill Preparation'!$X$4:$X$22,'Bill Preparation'!$Y$4:$Y$22))","v":0},{"$f":"S2","v":"2014-01-01"},"Date of effect","DA","ZPPF","diff","Date ","DA to ZPPF %",null,null,null,1,25220,400,250,200,0,{"$f":"IF(Data!$D$12='Bill Preparation'!$AH$2,'Bill Preparation'!AH3,IF(Data!$D$12='Bill Preparation'!$AE$2,'Bill Preparation'!AE3,IF(Data!$D$12='Bill Preparation'!$AG$2,'Bill Preparation'!AG3,'Bill Preparation'!AF3)))","v":0},{"$f":"DAY(B3)","v":11},{"$f":"MONTH(B3)","v":7},{"$f":"YEAR(B3)","v":2023},{"$f":"IF(AK3=2, 28,IF(AK3=4, 30,IF(AK3=6, 30,IF(AK3=9, 30,IF(AK3=11, 30, 31 )))))","v":31},{"$f":"IF(AM3=28,IF(AL3=2016,29,28),AM3)","v":31}]
["from",{"$f":"D3+1","v":"2023-08-01"},"to",{"$f":"DATE(YEAR(B4),MONTH(B4)+1,1)-1","v":"2023-08-31"},{"$f":"(D4-B4)+1","v":31},{"$f":"IF(B4>Data!$D$8,0,IF(B4>=Data!$H$19,Data!$I$19,IF(B4>=Data!$H$18,Data!$I$18,Data!$I$15)))","v":44570},{"$f":"IF(B4>Data!$D$8,0,IF(Data!$D$6=\"Yes\",Data!$O$7,Data!$B$8))","v":34580},22.75,{"$f":"IF(B4>Data!$D$8,0,I3)","v":10},0,{"$f":"IF(B4>Data!$D$8,0,LOOKUP(F4,$AC$3:$AC$6,$AI$3:$AI$6))","v":0},{"$f":"IF(B4>Data!$D$8,0,LOOKUP(G4,$AC$3:$AC$6,$AI$3:$AI$6))","v":0},{"$f":"IF(B4>Data!$D$8,0,M3)","v":0},{"$f":"IF(B4>Data!$D$8,0,N3)","v":0},{"$f":"IF(B4>Data!$D$8,0,O3)","v":0},{"$f":"IF(B4>Data!$D$8,0,IF(Data!$D$11=\"CA\",IF(ROUND('Bill Preparation'!F4*10%,0)<900,ROUND('Bill Preparation'!F4*10%,0),900),LOOKUP(Data!$B$4,'Bill Preparation'!$AD$9:$AD$11,'Bill Preparation'!$AG$9:$AG$11)))","v":0},{"$f":"IF(B4>Data!$D$8,0,IF(Data!$D$11=\"CA\",IF(ROUND('Bill Preparation'!G4*10%,0)<900,ROUND('Bill Preparation'!G4*10%,0),900),LOOKUP(Data!$B$4,'Bill Preparation'!$AD$9:$AD$11,'Bill Preparation'!$AG$9:$AG$11)))","v":0},{"$f":"IF(Data!$D$3=\"CPS\",0,LOOKUP('Bill Preparation'!B4,'Bill Preparation'!$X$4:$X$22,'Bill Preparation'!$Y$4:$Y$22))","v":0},null,"2018-07-01",0,null,0,{"$f":"T4","v":"2018-07-01"},0,null,null,null,25221,44570,600,350,300,0,{"$f":"IF(Data!$D$12='Bill Preparation'!$AH$2,'Bill Preparation'!AH4,IF(Data!$D$12='Bill Preparation'!$AE$2,'Bill Preparation'!AE4,IF(Data!$D$12='Bill Preparation'!$AG$2,'Bill Preparation'!AG4,'Bill Preparation'!AF4)))","v":0},{"$f":"DAY(B4)","v":1},{"$f":"MONTH(B4)","v":8},{"$f":"YEAR(B4)","v":2023},31,31,null,null,null,{"$f":"C37","v":"to"}]
["from",{"$f":"D4+1","v":"2023-09-01"},"to",{"$f":"DATE(YEAR(B5),MONTH(B5)+1,1)-1","v":"2023-09-30"},{"$f":"(D5-B5)+1","v":30},{"$f":"IF(B5>Data!$D$8,0,IF(B5>=Data!$H$19,Data!$I$19,IF(B5>=Data!$H$18,Data!$I$18,Data!$I$15)))","v":44570},{"$f":"IF(B5>Data!$D$8,0,IF(Data!$D$6=\"Yes\",Data!$O$7,Data!$B$8))","v":34580},22.75,{"$f":"IF(B5>Data!$D$8,0,I4)","v":10},0,{"$f":"IF(B5>Data!$D$8,0,LOOKUP(F5,$AC$3:$AC$6,$AI$3:$AI$6))","v":0},{"$f":"IF(B5>Data!$D$8,0,LOOKUP(G5,$AC$3:$AC$6,$AI$3:$AI$6))","v":0},{"$f":"IF(B5>Data!$D$8,0,M4)","v":0},{"$f":"IF(B5>Data!$D$8,0,N4)","v":0},{"$f":"IF(B5>Data!$D$8,0,O4)","v":0},{"$f":"IF(B5>Data!$D$8,0,IF(Data!$D$11=\"CA\",IF(ROUND('Bill Preparation'!F5*10%,0)<900,ROUND('Bill Preparation'!F5*10%,0),900),LOOKUP(Data!$B$4,'Bill Preparation'!$AD$9:$AD$11,'Bill Preparation'!$AG$9:$AG$11)))","v":0},{"$f":"IF(B5>Data!$D$8,0,IF(Data!$D$11=\"CA\",IF(ROUND('Bill Preparation'!G5*10%,0)<900,ROUND('Bill Preparation'!G5*10%,0),900),LOOKUP(Data!$B$4,'Bill Preparation'!$AD$9:$AD$11,'Bill Preparation'!$AG$9:$AG$11)))","v":0},{"$f":"IF(Data!$D$3=\"CPS\",0,LOOKUP('Bill Preparation'!B5,'Bill Preparation'!$X$4:$X$22,'Bill Preparation'!$Y$4:$Y$22))","v":0},null,"2019-01-01",2.73,null,{"$f":"U5-U4","v":2.73},{"$f":"T5","v":"2019-01-01"},0,null,null,null,44571,57100,700,450,350,0,{"$f":"IF(Data!$D$12='Bill Preparation'!$AH$2,'Bill Preparation'!AH5,IF(Data!$D$12='Bill Preparation'!$AE$2,'Bill Preparation'!AE5,IF(Data!$D$12='Bill Preparation'!$AG$2,'Bill Preparation'!AG5,'Bill Preparation'!AF5)))","v":0},1,9,2023,30,30,null,null,null,{"$f":"C38","v":"to"}]
["from","2023-10-01","to","2023-10-31",{"$f":"(D6-B6)+1","v":31},{"$f":"IF(B6>Data!$D$8,0,IF(B6>=Data!$H$19,Data!$I$19,IF(B6>=Data!$H$18,Data!$I$18,Data!$I$15)))","v":0},{"$f":"IF(B6>Data!$D$8,0,IF(Data!$D$6=\"Yes\",Data!$O$7,Data!$B$8))","v":0},{"$f":"IF(B6>Data!$D$8,0,LOOKUP(B6,$T$4:$T$16,$U$4:$U$16))","v":0},{"$f":"IF(B6>Data!$D$8,0,I5)","v":0},0,{"$f":"IF(B6>Data!$D$8,0,LOOKUP(F6,$AC$3:$AC$6,$AI$3:$AI$6))","v":0},{"$f":"IF(B6>Data!$D$8,0,LOOKUP(G6,$AC$3:$AC$6,$AI$3:$AI$6))","v":0},{"$f":"IF(B6>Data!$D$8,0,M5)","v":0},{"$f":"IF(B6>Data!$D$8,0,N5)","v":0},{"$f":"IF(B6>Data!$D$8,0,O5)","v":0},{"$f":"IF(B6>Data!$D$8,0,IF(Data!$D$11=\"CA\",IF(ROUND('Bill Preparation'!F6*10%,0)<900,ROUND('Bill Preparation'!F6*10%,0),900),LOOKUP(Data!$B$4,'Bill Preparation'!$AD$9:$AD$11,'Bill Preparation'!$AG$9:$AG$11)))","v":0},{"$f":"IF(B6>Data!$D$8,0,IF(Data!$D$11=\"CA\",IF(ROUND('Bill Preparation'!G6*10%,0)<900,ROUND('Bill Preparation'!G6*10%,0),900),LOOKUP(Data!$B$4,'Bill Preparation'!$AD$9:$AD$11,'Bill Preparation'!$AG$9:$AG$11)))","v":0},{"$f":"IF(Data!$D$3=\"CPS\",0,LOOKUP('Bill Preparation'!B6,'Bill Preparation'!$X$4:$X$22,'Bill Preparation'!$Y$4:$Y$22))","v":0},null,"2019-07-01",7.28,null,{"$f":"U6-U5","v":4.5500000000000007},"2019-07-01",0,null,null,null,57101,null,1000,700,500,0,{"$f":"IF(Data!$D$12='Bill Preparation'!$AH$2,'Bill Preparation'!AH6,IF(Data!$D$12='Bill Preparation'!$AE$2,'Bill Preparation'!AE6,IF(Data!$D$12='Bill Preparation'!$AG$2,'Bill Preparation'!AG6,'Bill Preparation'!AF6)))","v":0},1,10,2023,31,31,null,null,null,{"$f":"C39","v":"to"}]
["from","2023-11-01","to","2023-11-30",{"$f":"(D7-B7)+1","v":30},{"$f":"IF(B7>Data!$D$8,0,IF(B7>=Data!$H$19,Data!$I$19,IF(B7>=Data!$H$18,Data!$I$18,Data!$I$15)))","v":0},{"$f":"IF(B7>Data!$D$8,0,IF(Data!$D$6=\"Yes\",Data!$O$7,Data!$B$8))","v":0},{"$f":"IF(B7>Data!$D$8,0,LOOKUP(B7,$T$4:$T$16,$U$4:$U$16))","v":0},{"$f":"IF(B7>Data!$D$8,0,I6)","v":0},0,{"$f":"IF(B7>Data!$D$8,0,LOOKUP(F7,$AC$3:$AC$6,$AI$3:$AI$6))","v":0},{"$f":"IF(B7>Data!$D$8,0,LOOKUP(G7,$AC$3:$AC$6,$AI$3:$AI$6))","v":0},{"$f":"IF(B7>Data!$D$8,0,M6)","v":0},{"$f":"IF(B7>Data!$D$8,0,N6)","v":0},{"$f":"IF(B7>Data!$D$8,0,O6)","v":0},{"$f":"IF(B7>Data!$D$8,0,IF(Data!$D$11=\"CA\",IF(ROUND('Bill Preparation'!F7*10%,0)<900,ROUND('Bill Preparation'!F7*10%,0),900),LOOKUP(Data!$B$4,'Bill Preparation'!$AD$9:$AD$11,'Bill Preparation'!$AG$9:$AG$11)))","v":0},{"$f":"IF(B7>Data!$D$8,0,IF(Data!$D$11=\"CA\",IF(ROUND('Bill Preparation'!G7*10%,0)<900,ROUND('Bill Preparation'!G7*10%,0),900),LOOKUP(Data!$B$4,'Bill Preparation'!$AD$9:$AD$11,'Bill Preparation'!$AG$9:$AG$11)))","v":0},{"$f":"IF(Data!$D$3=\"CPS\",0,LOOKUP('Bill Preparation'!B7,'Bill Preparation'!$X$4:$X$22,'Bill Preparation'!$Y$4:$Y$22))","v":0},null,"2020-01-01",10.92,"2020-04-01",3.6399999999999997,"2020-01-01",3.6399999999999997,null,null,null,null,null,null,null,null,null,null,1,11,2023,30,30,null,null,null,{"$f":"C40","v":"to"}]
["from","2023-12-01","to","2023-12-31",{"$f":"(D8-B8)+1","v":31},{"$f":"IF(B8>Data!$D$8,0,IF(B8>=Data!$H$19,Data!$I$19,IF(B8>=Data!$H$18,Data!$I$18,Data!$I$15)))","v":0},{"$f":"IF(B8>Data!$D$8,0,IF(Data!$D$6=\"Yes\",Data!$O$7,Data!$B$8))","v":0},{"$f":"IF(B8>Data!$D$8,0,LOOKUP(B8,$T$4:$T$16,$U$4:$U$16))","v":0},{"$f":"IF(B8>Data!$D$8,0,I7)","v":0},0,{"$f":"IF(B8>Data!$D$8,0,LOOKUP(F8,$AC$3:$AC$6,$AI$3:$AI$6))","v":0},{"$f":"IF(B8>Data!$D$8,0,LOOKUP(G8,$AC$3:$AC$6,$AI$3:$AI$6))","v":0},{"$f":"IF(B8>Data!$D$8,0,M7)","v":0},{"$f":"IF(B8>Data!$D$8,0,N7)","v":0},{"$f":"IF(B8>Data!$D$8,0,O7)","v":0},{"$f":"IF(B8>Data!$D$8,0,IF(Data!$D$11=\"CA\",IF(ROUND('Bill Preparation'!F8*10%,0)<900,ROUND('Bill Preparation'!F8*10%,0),900),LOOKUP(Data!$B$4,'Bill Preparation'!$AD$9:$AD$11,'Bill Preparation'!$AG$9:$AG$11)))","v":0},{"$f":"IF(B8>Data!$D$8,0,IF(Data!$D$11=\"CA\",IF(ROUND('Bill Preparation'!G8*10%,0)<900,ROUND('Bill Preparation'!G8*10%,0),900),LOOKUP(Data!$B$4,'Bill Preparation'!$AD$9:$AD$11,'Bill Preparation'!$AG$9:$AG$11)))","v":0},{"$f":"IF(Data!$D$3=\"CPS\",0,LOOKUP('Bill Preparation'!B8,'Bill Preparation'!$X$4:$X$22,'Bill Preparation'!$Y$4:$Y$22))","v":0},null,"2020-07-01",13.65,"2020-04-01",2.7300000000000004,"2020-07-01",3.1440000000000001,null,null,null,null,null,"CA","RA","CA/RA",null,null,1,12,2023,31,31]
{"$rows_left_out":34}
{"sheet":"Bill","index":3,"n_rows":42,"n_cols":47,"rows_kept":42,"cut":false,"hidden":false,"merged":[[41,0,41,24],[0,0,0,40],[1,0,1,40],[2,0,2,40],[3,0,3,39],[4,0,4,1],[4,3,4,13],[4,14,4,24],[4,25,4,39],[4,40,5,40],[4,2,5,2]]}
["Note : In this \"Bill Sheet\" if any variation found , Change the corresponding entries in the \"Bill Preparation\" Sheet.\n          Hide unnecessary rows and columns in this sheet and then print out this sheet."]
[{"$f":"\"Claim for Promotion Pay fixation arrears of  \"&Data!B2&\", \"&Data!D4","v":"Claim for Promotion Pay fixation arrears of  Smt Shaik ASHITUN (CFMS ID15087189),  SCHOOL ASST(Phy Ed)"}]
[]
[{"$f":"\"Vide the Proceedings RC No : \"&Data!B17& \" dt.\"&Data!F17&\" of the \"&PROPER(Data!B15)&\", \"&Data!B16","v":"Vide the Proceedings RC No : 5/ PROMOTION FR 22B /2023 dt.19-9-2023 of the Head Master,  ZPHIGH SCHOOL  EDLAPADU "}]
["Period",null,"No of Days","To be drawn",null,null,null,null,null,null,null,null,null,null,"Already drawn ",null,null,null,null,null,null,null,null,null,null,"Difference",null,null,null,null,null,null,null,null,null,null,null,null,null,null,"REMARKS"]
["From","To",null,"PAY","pp","FP","S Pay","D A","H R A ","IR","PHA","CCA","GROSS","PT","PAY","pp","FP","S Pay","D A","H R A ","IR","PHA","CCA","GROSS","PT","PAY","pp","FP","S Pay","D A","H R A ","IR","PHA","CCA","GROSS","ZPPF","PT","CPS"," GOVT. RECOVERIES","Net Payable"]
[{"$f":"'Bill Preparation'!B3","v":"2023-07-11"},{"$f":"'Bill Preparation'!D3","v":"2023-07-31"},{"$f":"(B7-A7)+1","v":21},{"$f":"ROUND('Bill Preparation'!F3*C7/'Bill Preparation'!AN3,0)","v":30193},{"$f":"ROUND('Bill Preparation'!M3*C7/'Bill Preparation'!AN3,0)","v":0},{"$f":"ROUND('Bill Preparation'!N3*C7/'Bill Preparation'!AN3,0)","v":0},{"$f":"ROUND('Bill Preparation'!O3*C7/'Bill Preparation'!AN3,0)","v":0},{"$f":"ROUND(D7*'Bill Preparation'!H3/100,0)","v":6869},{"$f":"IF(ROUND(D7*'Bill Preparation'!I3/100,0)>('Bill Preparation'!I3+1)*1000,('Bill Preparation'!I3+1)*1000,ROUND(D7*'Bill Preparation'!I3/100,0))","v":3019},{"$f":"ROUND(D7*'Bill Preparation'!J3/100,0)","v":0},{"$f":"ROUND('Bill Preparation'!P3*C7/'Bill Preparation'!AN3,0)","v":0},{"$f":"ROUND('Bill Preparation'!K3*C7/'Bill Preparation'!AN3,0)","v":0},{"$f":"SUM(D7:L7)","v":40081},{"$f":"IF([1]Data!$B$32=\"Yes\",0,IF(C7>AQ7/2,AS7,0))","v":200},{"$f":"ROUND('Bill Preparation'!G3*C7/'Bill Preparation'!AN3,0)","v":23425},{"$f":"ROUND('Bill Preparation'!M3*C7/'Bill Preparation'!AN3,0)","v":0},{"$f":"ROUND('Bill Preparation'!N3*C7/'Bill Preparation'!AN3,0)","v":0},{"$f":"ROUND('Bill Preparation'!O3*C7/'Bill Preparation'!AN3,0)","v":0},{"$f":"ROUND(O7*'Bill Preparation'!H3/100,0)","v":5329},{"$f":"IF(ROUND(O7*'Bill Preparation'!I3/100,0)>('Bill Preparation'!I3+1)*1000,('Bill Preparation'!I3+1)*1000,ROUND(O7*'Bill Preparation'!I3/100,0))","v":2343},{"$f":"ROUND(O7*'Bill Preparation'!J3/100,0)","v":0},{"$f":"ROUND('Bill Preparation'!Q3*C7/'Bill Preparation'!AN3,0)","v":0},{"$f":"ROUND('Bill Preparation'!L3*C7/'Bill Preparation'!AN3,0)","v":0},{"$f":"SUM(O7:W7)","v":31097},{"$f":"IF([1]Data!$B$32=\"Yes\",0,IF(C7>AQ7/2,AU7,0))","v":200},{"$f":"D7-O7","v":6768},0,0,0,1540,676,0,0,0,{"$f":"SUM(Z7:AH7)","v":8984},{"$f":"IF(Data!$D$3=\"CPS\",0,ROUND(Z7*'Bill Preparation'!R3%,0))","v":0},{"$f":"N7-Y7","v":0},{"$f":"IF(Data!$D$3=\"CPS\",ROUND((Z7+AD7)*10%,0),0)","v":831},{"$f":"SUM(AJ7:AL7)","v":831},{"$f":"AI7-AM7","v":8153},null,{"$f":"MONTH(A7)*1","v":7},{"$f":"IF(AP7=2,IF(YEAR(A7)=2012,\"29\",\"28\"),IF(AP7=4,\"30\",IF(AP7=6,\"30\",IF(AP7=9,\"30\",IF(AP7=11,\"30\",\"31\")))))","v":"31"},{"$f":"'Bill Preparation'!F3+'Bill Preparation'!M3+ROUND('Bill Preparation'!F3*'Bill Preparation'!H3/100,0)+ROUND('Bill Preparation'!F3*'Bill Preparation'!I3/100,0)+'Bill Preparation'!K3+'Bill Preparation'!N3+'Bill Preparation'!O3","v":59167},{"$f":"IF(AR7>20000,200,IF(AR7>15000,150,IF(AR7>10000,100,IF(AR7>5000,80,0))))","v":200},{"$f":"'Bill Preparation'!G3+'Bill Preparation'!M3+ROUND('Bill Preparation'!G3*'Bill Preparation'!H3/100,0)+ROUND('Bill Preparation'!G3*'Bill Preparation'!I3/100,0)+'Bill Preparation'!L3+'Bill Preparation'!N3+'Bill Preparation'!O3","v":45905},{"$f":"IF(AT7>20000,200,IF(AT7>15000,150,IF(AT7>10000,100,IF(AT7>5000,80,0))))","v":200}]
[{"$f":"'Bill Preparation'!B4","v":"2023-08-01"},{"$f":"'Bill Preparation'!D4","v":"2023-08-31"},31,{"$f":"ROUND('Bill Preparation'!F4*C8/'Bill Preparation'!AN4,0)","v":44570},{"$f":"ROUND('Bill Preparation'!M4*C8/'Bill Preparation'!AN4,0)","v":0},{"$f":"ROUND('Bill Preparation'!N4*C8/'Bill Preparation'!AN4,0)","v":0},{"$f":"ROUND('Bill Preparation'!O4*C8/'Bill Preparation'!AN4,0)","v":0},{"$f":"ROUND(D8*'Bill Preparation'!H4/100,0)","v":10140},{"$f":"IF(ROUND(D8*'Bill Preparation'!I4/100,0)>('Bill Preparation'!I4+1)*1000,('Bill Preparation'!I4+1)*1000,ROUND(D8*'Bill Preparation'!I4/100,0))","v":4457},{"$f":"ROUND(D8*'Bill Preparation'!J4/100,0)","v":0},{"$f":"ROUND('Bill Preparation'!P4*C8/'Bill Preparation'!AN4,0)","v":0},{"$f":"ROUND('Bill Preparation'!K4*C8/'Bill Preparation'!AN4,0)","v":0},59167,{"$f":"IF([1]Data!$B$32=\"Yes\",0,IF(C8>AQ8/2,AS8,0))","v":200},{"$f":"ROUND('Bill Preparation'!G4*C8/'Bill Preparation'!AN4,0)","v":34580},{"$f":"ROUND('Bill Preparation'!M4*C8/'Bill Preparation'!AN4,0)","v":0},{"$f":"ROUND('Bill Preparation'!N4*C8/'Bill Preparation'!AN4,0)","v":0},{"$f":"ROUND('Bill Preparation'!O4*C8/'Bill Preparation'!AN4,0)","v":0},{"$f":"ROUND(O8*'Bill Preparation'!H4/100,0)","v":7867},{"$f":"IF(ROUND(O8*'Bill Preparation'!I4/100,0)>('Bill Preparation'!I4+1)*1000,('Bill Preparation'!I4+1)*1000,ROUND(O8*'Bill Preparation'!I4/100,0))","v":3458},{"$f":"ROUND(O8*'Bill Preparation'!J4/100,0)","v":0},{"$f":"ROUND('Bill Preparation'!Q4*C8/'Bill Preparation'!AN4,0)","v":0},{"$f":"ROUND('Bill Preparation'!L4*C8/'Bill Preparation'!AN4,0)","v":0},45905,{"$f":"IF([1]Data!$B$32=\"Yes\",0,IF(C8>AQ8/2,AU8,0))","v":200},9990,0,0,0,2273,999,0,0,0,13262,{"$f":"IF(Data!$D$3=\"CPS\",0,ROUND(Z8*'Bill Preparation'!R4%,0))","v":0},{"$f":"IF(C8>AQ8/2,(N8-Y8),0)","v":0},{"$f":"IF(Data!$D$3=\"CPS\",ROUND((Z8+AD8)*10%,0),0)","v":1226},{"$f":"SUM(AJ8:AL8)","v":1226},12036,null,8,"31",{"$f":"'Bill Preparation'!F4+'Bill Preparation'!M4+ROUND('Bill Preparation'!F4*'Bill Preparation'!H4/100,0)+ROUND('Bill Preparation'!F4*'Bill Preparation'!I4/100,0)+'Bill Preparation'!K4+'Bill Preparation'!N4+'Bill Preparation'!O4","v":59167},200,{"$f":"'Bill Preparation'!G4+'Bill Preparation'!M4+ROUND('Bill Preparation'!G4*'Bill Preparation'!H4/100,0)+ROUND('Bill Preparation'!G4*'Bill Preparation'!I4/100,0)+'Bill Preparation'!L4+'Bill Preparation'!N4+'Bill Preparation'!O4","v":45905},200]
{"$rows_left_out":35}
{"sheet":"aptc 49","index":4,"n_rows":13,"n_cols":14,"rows_kept":13,"cut":false,"hidden":false,"merged":[[10,1,10,13],[12,9,12,12],[9,1,9,13],[7,1,8,1],[7,2,8,2],[7,3,8,3],[4,13,5,13],[0,0,0,13],[1,0,1,13],[2,0,2,13],[3,0,3,13],[4,0,5,0],[4,1,5,1],[4,2,5,2],[4,3,5,3],[4,4,5,4],[4,5,4,6],[4,7,4,8],[4,9,5,9],[4,10,5,10],[4,11,5,11],[4,12,5,12]]}
["A.P.T.C.FORM – 49"]
["PERIODICAL INCREMENT CERTIFICATE"]
["ANNEXURE"]
["        (1) Certified that every Government Servant(s) named below has have earned the prescribed periodical increment from date/dates noted in column 10 and either 1 (a) has / have been the incumbent or the appointment indicated against his name / their names for a period not less than ………..year since the date in column 5 or (if he has /they have been suspended for misconduct) column 7 after deducting the periods between the dates shown in column (8) and has (9) and has been subjected in any order of stop page of increment as penalty during the periods, and during the periods of leave on average pay taken at a time and from ………………………..which has / have been conducted for increment / in the case of officiating Government Servant / Servants named below the / they would have officiated in the post/ posts but for his / their going on leave or ……………………."]
["Sl.No.","Name","Appointment","Whether Substantive \nor Officiating","Date from which \npresent pay as drawn","Suspension for\n Misconduct",null,"Leave without pay and in the case of these holding the post  temporarily or in an officiating capacity all kinds of leave other than leave on average pay ",null,"Date from which increment may be given","Scale","Present Pay","Amount of increment","Future Pay"]
[null,null,null,null,null,"From","to","From","to"]
[1,2,3,4,5,6,7,8,9,10,11,12,13,14]
[1,{"$f":"Data!B2","v":"Smt Shaik ASHITUN (CFMS ID15087189)"},{"$f":"Data!D4","v":" SCHOOL ASST(Phy Ed)"},"Substantive"]
{"$rows_left_out":5}